Target
Neuronal acetylcholine receptor subunit alpha-2/beta-2
Ligand
BDBM50428086
Substrate
Meas. Tech.
[3H]-Epibatidine Radioligand Binding Assay
pH
7.4±n/a
Temperature
277.15±n/a K
Ki
8.6±n/a nM
Comments
extracted
Citation
 Xiao, YKellar, KJBrown, MLPaige, MALiu, YLevin, EDRezvani, AH 2,5-disubstituted-pyridyl nicotinic ligands, and methods of use thereof US Patent  US9303017 Publication Date 4/5/2016 
Target
Name:
Neuronal acetylcholine receptor subunit alpha-2/beta-2
Synonyms:
Neuronal acetylcholine receptor protein alpha-2/beta-2 subunit nAChR subtypes alpha2 beta2
Type:
Mol. Mass.:
Description:
ASSAY_ID of EBI is 143226
Components:
This complex has 2 components.
Component 1
Name:
Neuronal acetylcholine receptor subunit alpha-2
Synonyms:
ACHA2_RAT Cholinergic, Nicotinic Alpha2Beta2 Chrna2
Type:
Enzyme
Mol. Mass.:
58597.25
Organism:
Rattus norvegicus (Rat)
Description:
P12389
Residue:
511
  
Component 2
Name:
Neuronal acetylcholine receptor subunit beta-2
Synonyms:
ACHB2_RAT Chrnb2 Neuronal acetylcholine receptor non-alpha-1 chain
Type:
Enzyme
Mol. Mass.:
56910.32
Organism:
Rattus norvegicus (Rat)
Description:
P12390
Residue:
500
  
Inhibitor
Name:
BDBM50428086
Synonyms:
CHEMBL2323572 | US9303017, (S)-21, YL-1-235
Type:
Small organic molecule
Emp. Form.:
C16H21ClN2O
Mol. Mass.:
292.804
SMILES:
Cc1ncc(cc1OC[C@@H]1CCN1)C#CCCCCCl
: