Target
Neuronal acetylcholine receptor subunit alpha-3/beta-4
Ligand
BDBM50428086
Substrate
Meas. Tech.
[3H]-Epibatidine Radioligand Binding Assay
pH
7.4±n/a
Temperature
277.15±n/a K
Ki
86000±n/a nM
Comments
extracted
Citation
 Xiao, YKellar, KJBrown, MLPaige, MALiu, YLevin, EDRezvani, AH 2,5-disubstituted-pyridyl nicotinic ligands, and methods of use thereof US Patent  US9303017 Publication Date 4/5/2016 
Target
Name:
Neuronal acetylcholine receptor subunit alpha-3/beta-4
Synonyms:
Neuronal acetylcholine receptor Alpha-3/Beta-4 Neuronal acetylcholine receptor; alpha3/beta4 | nAChR subtypes alpha3 beta4
Type:
Protein
Mol. Mass.:
Description:
Components:
This complex has 2 components.
Component 1
Name:
Neuronal acetylcholine receptor subunit alpha-3
Synonyms:
ACHA3_RAT Chrna3
Type:
Enzyme
Mol. Mass.:
56995.52
Organism:
Rattus norvegicus (Rat)
Description:
P04757
Residue:
499
  
Component 2
Name:
Neuronal acetylcholine receptor subunit beta-4
Synonyms:
ACHB4_RAT Chrnb4 Neuronal acetylcholine receptor non-alpha-2 chain | Neuronal acetylcholine receptor protein beta-4 subunit
Type:
Enzyme
Mol. Mass.:
55863.89
Organism:
Rattus norvegicus (Rat)
Description:
P12392
Residue:
495
  
Inhibitor
Name:
BDBM50428086
Synonyms:
CHEMBL2323572 | US9303017, (S)-21, YL-1-235
Type:
Small organic molecule
Emp. Form.:
C16H21ClN2O
Mol. Mass.:
292.804
SMILES:
Cc1ncc(cc1OC[C@@H]1CCN1)C#CCCCCCl
: