Target
Orexin receptor type 2
Ligand
BDBM221311
Substrate
Meas. Tech.
In Vitro Assay
Temperature
310.15±n/a K
IC50
53±n/a nM
Comments
extracted
Citation
 Bolli, MBoss, CBrotschi, CGude, MHeidmann, BSifferlen, TWilliams, JT Pyrazole and imidazole derivatives useful as orexin antagonists US Patent  US9303023 Publication Date 4/5/2016 
Target
Name:
Orexin receptor type 2
Synonyms:
HCRTR2 OX2R_HUMAN Orexin receptor type 2 (OR-2) Orexin receptor type 2 (OX2R) Ox-2-R | Ox2-R
Type:
Protein
Mol. Mass.:
50710.53
Organism:
Homo sapiens (Human)
Description:
O43614
Residue:
444
  
Inhibitor
Name:
BDBM221311
Synonyms:
US9303023, 10
Type:
Small organic molecule
Emp. Form.:
C21H19FN6O5
Mol. Mass.:
454.4112
SMILES:
COc1cc(OC)nc(OCCn2cc(NC(=O)c3ncoc3-c3cccc(F)c3)cn2)n1
: