Target
Orexin receptor type 2
Ligand
BDBM221366
Substrate
Meas. Tech.
In Vitro Assay
Temperature
310.15±n/a K
IC50
98±n/a nM
Comments
extracted
Citation
 Bolli, MBoss, CBrotschi, CGude, MHeidmann, BSifferlen, TWilliams, JT Pyrazole and imidazole derivatives useful as orexin antagonists US Patent  US9303023 Publication Date 4/5/2016 
Target
Name:
Orexin receptor type 2
Synonyms:
HCRTR2 OX2R_HUMAN Orexin receptor type 2 (OR-2) Orexin receptor type 2 (OX2R) Ox-2-R | Ox2-R
Type:
Protein
Mol. Mass.:
50710.53
Organism:
Homo sapiens (Human)
Description:
O43614
Residue:
444
  
Inhibitor
Name:
BDBM221366
Synonyms:
US9303023, 62
Type:
Small organic molecule
Emp. Form.:
C24H20FN5O2
Mol. Mass.:
429.4463
SMILES:
Cc1cccc(c1)-c1ocnc1C(=O)Nc1cnn(CCc2c[nH]c3ccc(F)cc23)c1
: