Target
Orexin receptor type 2
Ligand
BDBM221423
Substrate
Meas. Tech.
In Vitro Assay
Temperature
310.15±n/a K
IC50
78±n/a nM
Comments
extracted
Citation
 Bolli, MBoss, CBrotschi, CGude, MHeidmann, BSifferlen, TWilliams, JT Pyrazole and imidazole derivatives useful as orexin antagonists US Patent  US9303023 Publication Date 4/5/2016 
Target
Name:
Orexin receptor type 2
Synonyms:
HCRTR2 OX2R_HUMAN Orexin receptor type 2 (OR-2) Orexin receptor type 2 (OX2R) Ox-2-R | Ox2-R
Type:
Protein
Mol. Mass.:
50710.53
Organism:
Homo sapiens (Human)
Description:
O43614
Residue:
444
  
Inhibitor
Name:
BDBM221423
Synonyms:
US9303023, 120
Type:
Small organic molecule
Emp. Form.:
C21H21N7O3
Mol. Mass.:
419.4365
SMILES:
COc1ccnc(NCCn2cc(NC(=O)c3ncoc3-c3cccc(C)c3)cn2)n1
: