Target
Cystic fibrosis transmembrane conductance regulator
Ligand
BDBM221978
Substrate
Meas. Tech.
IonWorks Quattro Assay
IC50
4.23±n/a nM
Citation
 Ahmed, MAshall-Kelly, ABloomfield, GCGueritz, LMcKenna, JMcKenna, JMutton, SParmar, RSheperd, JWright, P Substituted pyrazino[1′,2′:1,2]pyrrolo[3,4-d]pyrimidines, pyrimido[4′,5′:3,4]pyrrolo[2,1-c][1,4]oxazines and pyrimido[4′,5′:3,4]pyrrolo[1,2-d][1,4]oxazepines for inhibiting the CFTR channel US Patent  US9303035 Publication Date 4/5/2016 
Target
Name:
Cystic fibrosis transmembrane conductance regulator
Synonyms:
cystic fibrosis transmembrane conductance regulator protein (CFTR)
Type:
Protein
Mol. Mass.:
125499.86
Organism:
Cricetulus griseus (Chinese hamster)
Description:
G3H9J3
Residue:
1107
  
Inhibitor
Name:
BDBM221978
Synonyms:
US9303035, 4.1 | US9303035, 4.3
Type:
Small organic molecule
Emp. Form.:
C22H21N3O4
Mol. Mass.:
391.4198
SMILES:
Cc1ccc(o1)C1OCCn2c1c1n(C)c(=O)n(C)c(=O)c1c2-c1ccccc1
: