Target
C-X-C chemokine receptor type 4
Ligand
BDBM221857
Substrate
Meas. Tech.
Calcium Mobilization Assay
Temperature
310.15±n/a K
IC50
4±n/a nM
Comments
extracted
Citation
 Clark, MPWagner, FFNatchus, MGDoroh, BCJohnson, TLTahirovic, YAWilson, LWiseman, JMSkudlarek, JWLockwood, MA Chemokine receptor modulators US Patent  US9314468 Publication Date 4/19/2016 
Target
Name:
C-X-C chemokine receptor type 4
Synonyms:
C-X-C chemokine receptor type 4 CD_antigen=CD184 CXCR-4 CXCR4_HUMAN Fusin LCR1 Leukocyte-derived seven transmembrane domain receptor SDF-1 receptor | Stromal cell-derived factor 1 receptor
Type:
Enzyme
Mol. Mass.:
39754.61
Organism:
Homo sapiens (Human)
Description:
P61073
Residue:
352
  
Inhibitor
Name:
BDBM221857
Synonyms:
US9314468, Table 7, Compound 144
Type:
Small organic molecule
Emp. Form.:
C29H35N5
Mol. Mass.:
453.6217
SMILES:
NCCCCN(Cc1nccc2c3ccccc3n(CC3CC3)c12)[C@H]1CCCc2cccnc12
: