Target
C-X-C chemokine receptor type 4
Ligand
BDBM221865
Substrate
Meas. Tech.
Inhibition Assay
IC50
5.6±n/a nM
Citation
 Clark, MPWagner, FFNatchus, MGDoroh, BCJohnson, TLTahirovic, YAWilson, LWiseman, JMSkudlarek, JWLockwood, MA Chemokine receptor modulators US Patent  US9314468 Publication Date 4/19/2016 
Target
Name:
C-X-C chemokine receptor type 4
Synonyms:
C-X-C chemokine receptor type 4 CD_antigen=CD184 CXCR-4 CXCR4_HUMAN Fusin LCR1 Leukocyte-derived seven transmembrane domain receptor SDF-1 receptor | Stromal cell-derived factor 1 receptor
Type:
Enzyme
Mol. Mass.:
39754.61
Organism:
Homo sapiens (Human)
Description:
P61073
Residue:
352
  
Inhibitor
Name:
BDBM221865
Synonyms:
US9314468, Table 8, Compound 3
Type:
Small organic molecule
Emp. Form.:
C31H38N6O2
Mol. Mass.:
526.6724
SMILES:
NCCCCN(Cc1nccc2c3ccccc3n(CC(=O)N3CCOCC3)c12)C1CCCc2cccnc12
: