Target
Lysophosphatidic acid receptor 1
Ligand
BDBM290668
Substrate
Meas. Tech.
In Vitro LPA1 Receptor Assay
Temperature
298.15±n/a K
IC50
32.0±n/a nM
Comments
extracted
Citation
 Buffham, WCanning, HDavenport, RFarnaby, WMack, SParmar, AWright, S Amide derivatives as lysophosphatidic acid receptor antagonists US Patent  US10100018 Publication Date 10/16/2018 
Target
Name:
Lysophosphatidic acid receptor 1
Synonyms:
EDG2 LPA-1 LPAR1 Lysophosphatidic acid receptor 1 (LPA1) | Lysophosphatidic acid receptor Edg-2
Type:
Enzyme
Mol. Mass.:
41120.55
Organism:
Homo sapiens (Human)
Description:
Q92633
Residue:
364
  
Inhibitor
Name:
BDBM290668
Synonyms:
US10100018, Example 58
Type:
Small organic molecule
Emp. Form.:
C31H34FNO5
Mol. Mass.:
519.6038
SMILES:
COc1ccccc1O[C@H]1CCC(CC1)C(=O)N(CCCc1cccc(F)c1)Cc1ccc(cc1)C(O)=O
: