Target
Gag-Pol polyprotein
Ligand
BDBM222420
Substrate
Meas. Tech.
HIV-1 RT In-Vitro Assay
IC50
7.628e+4±n/a nM
Citation
 Chander, STang, CRAl-Maqtari, HMJamalis, JPenta, AHadda, TBSirat, HMZheng, YTSankaranarayanan, M Synthesis and study of anti-HIV-1 RT activity of 5-benzoyl-4-methyl-1,3,4,5-tetrahydro-2H-1,5-benzodiazepin-2-one derivatives. Bioorg Chem 72:74-79 (2017)  
Target
Name:
Gag-Pol polyprotein
Synonyms:
HIV-1 reverse transcriptase (HIV-1 RT) POL_HV1H2 Protease Reverse transcriptase (RT) gag-pol p66 RT
Type:
Protein
Mol. Mass.:
162074.74
Organism:
Human immunodeficiency virus type 1 group M subtype B (isolate HXB2)
Description:
P04585
Residue:
1435
  
Inhibitor
Name:
BDBM222420
Synonyms:
5-(3-fluorobenzoyl)-4-methyl-1,3,4,5-tetrahydro-2H-1,5-benzodiazepin-2-one (A8)
Type:
Small organic molecule
Emp. Form.:
C17H15FN2O2
Mol. Mass.:
298.3116
SMILES:
CC1CC(=O)Nc2ccccc2N1C(=O)c1cccc(F)c1
: