Target
DNA polymerase catalytic subunit
Ligand
BDBM222918
Substrate
Meas. Tech.
HCMV Polymerase LANCE TR-FRET Assay
pH
7.5±n/a
IC50
1000±n/a nM
Comments
extracted
Citation
 Fader, LLepage, OBailey, MBeaulieu, PLBilodeau, FCarson, RJGiroux, AGodbout, CMoreau, BNaud, JParisien, MPoirier, MPoirier, MSurprenant, SThibeault, C Cytomegalovirus inhibitor compounds US Patent  US9315499 Publication Date 4/19/2016 
Target
Name:
DNA polymerase catalytic subunit
Synonyms:
DNA polymerase HFLF2 UL54
Type:
Protein
Mol. Mass.:
137111.39
Organism:
Human cytomegalovirus (HCMV strain AD169)
Description:
P08546
Residue:
1242
  
Inhibitor
Name:
BDBM222918
Synonyms:
US9315499, 5011
Type:
Small organic molecule
Emp. Form.:
C27H29ClN6O4
Mol. Mass.:
537.01
SMILES:
CN(CC(C)(C)CO)C(=O)Cn1c2nc(ccc2cc(C(=O)NCc2ccc(Cl)cc2)c1=O)-c1cn[nH]c1
: