Target
DNA polymerase catalytic subunit
Ligand
BDBM222920
Substrate
Meas. Tech.
HCMV Polymerase LANCE TR-FRET Assay
pH
7.5±n/a
IC50
1200±n/a nM
Comments
extracted
Citation
 Fader, LLepage, OBailey, MBeaulieu, PLBilodeau, FCarson, RJGiroux, AGodbout, CMoreau, BNaud, JParisien, MPoirier, MPoirier, MSurprenant, SThibeault, C Cytomegalovirus inhibitor compounds US Patent  US9315499 Publication Date 4/19/2016 
Target
Name:
DNA polymerase catalytic subunit
Synonyms:
DNA polymerase HFLF2 UL54
Type:
Protein
Mol. Mass.:
137111.39
Organism:
Human cytomegalovirus (HCMV strain AD169)
Description:
P08546
Residue:
1242
  
Inhibitor
Name:
BDBM222920
Synonyms:
US9315499, 6001
Type:
Small organic molecule
Emp. Form.:
C29H30ClN5O4S
Mol. Mass.:
580.098
SMILES:
COc1c(cnc2n(CC(=O)N3CC(C)(C)C3)c(=O)c(cc12)C(=O)NCc1ccc(Cl)cc1)-c1sc(C)nc1C
: