Target
Tyrosine-protein kinase SYK [2-635]
Ligand
BDBM222932
Substrate
Meas. Tech.
Chip Based Microfluidic Mobility Shift Assay
pH
7.5±n/a
Temperature
303.15±n/a K
IC50
0.6±n/a nM
Comments
extracted
Citation
 Buehlmayer, PSmith, ABThoma, GVan Eis, M Bicyclic heteroaryl cycloalkyldiamine derivatives US Patent  US9315500 Publication Date 4/19/2016 
Target
Name:
Tyrosine-protein kinase SYK [2-635]
Synonyms:
KSYK_HUMAN Tyrosine-protein kinase SYK | Tyrosine-protein kinase SYK (SYK)
Type:
Protein
Mol. Mass.:
71948.80
Organism:
Homo sapiens (Human)
Description:
Human Syk (2-635 aa) (UniProtKB: P43405)
Residue:
634
  
Inhibitor
Name:
BDBM222932
Synonyms:
US9315500, 2.2
Type:
Small organic molecule
Emp. Form.:
C22H25N7O
Mol. Mass.:
403.4802
SMILES:
Cn1ccc2c(Nc3nc(N[C@@H]4CCCC[C@@H]4N)cc4cn[nH]c(=O)c34)cccc12
: