Target
Tyrosine-protein kinase SYK [2-635]
Ligand
BDBM222944
Substrate
Meas. Tech.
Chip Based Microfluidic Mobility Shift Assay
pH
7.5±n/a
Temperature
303.15±n/a K
IC50
8±n/a nM
Comments
extracted
Citation
 Buehlmayer, PSmith, ABThoma, GVan Eis, M Bicyclic heteroaryl cycloalkyldiamine derivatives US Patent  US9315500 Publication Date 4/19/2016 
Target
Name:
Tyrosine-protein kinase SYK [2-635]
Synonyms:
KSYK_HUMAN Tyrosine-protein kinase SYK | Tyrosine-protein kinase SYK (SYK)
Type:
Protein
Mol. Mass.:
71948.80
Organism:
Homo sapiens (Human)
Description:
Human Syk (2-635 aa) (UniProtKB: P43405)
Residue:
634
  
Inhibitor
Name:
BDBM222944
Synonyms:
US9315500, 2.14
Type:
Small organic molecule
Emp. Form.:
C22H22N8O
Mol. Mass.:
414.4631
SMILES:
N[C@H]1CCCC[C@H]1Nc1cc2cn[nH]c(=O)c2c(Nc2cccc3c(c[nH]c23)C#N)n1
: