Target
Proto-oncogene tyrosine-protein kinase Src
Ligand
BDBM6189
Substrate
Poly(E:Y)
Meas. Tech.
Kinase Inhibition Assay
IC50
22000±n/a nM
Citation
 Thompson, AMDelaney, AMHamby, JMSchroeder, MCSpoon, TACrean, SMShowalter, HDDenny, WA Synthesis and structure-activity relationships of soluble 7-substituted 3-(3,5-dimethoxyphenyl)-1,6-naphthyridin-2-amines and related ureas as dual inhibitors of the fibroblast growth factor receptor-1 and vascular endothelial growth factor receptor-2 tyrosine kinases. J Med Chem 48:4628-53 (2005)  
Target
Name:
Proto-oncogene tyrosine-protein kinase Src
Synonyms:
Calmodulin/Proto-oncogene tyrosine-protein kinase Src Proto-oncogene c-Src SRC SRC_HUMAN V-src sarcoma (Schmidt-Ruppin A-2) viral oncogene homolog (avian) p60-Src | pp60c-src
Type:
Protein
Mol. Mass.:
59838.60
Organism:
Homo sapiens (Human)
Description:
P12931
Residue:
536
  
Inhibitor
Name:
BDBM6189
Synonyms:
1-(2-{[4-(diethylamino)butyl]amino}-6-(3,5-dimethoxyphenyl)pyrido[2,3-d]pyrimidin-7-yl)-3-ethylurea Pyrido[2,3-d]pyrimidine 104
Type:
Small organic molecule
Emp. Form.:
C26H37N7O3
Mol. Mass.:
495.6171
SMILES:
CCNC(=O)Nc1nc2nc(NCCCCN(CC)CC)ncc2cc1-c1cc(OC)cc(OC)c1
:
Substrate
Name:
Poly(E:Y)
Synonyms:
Type:
Random polymer
Mol. Mass.:
358.43
Organism:
Description:
Random copolymer of glutamic acid and tyrosine (4:1).
Residue:
3
NA