Target
Ezrin
Ligand
BDBM223224
Substrate
Meas. Tech.
SPR Assay
pH
5.5±n/a
Temperature
298.15±n/a K
Kd
2.196e+4± 6.11e+3 nM
Comments
extracted
Citation
 Rox, KRohde, MChhatwal, GSMüller, R Disorazoles Block Group A Streptococcal Invasion into Epithelial Cells Via Interference with the Host Factor Ezrin. Cell Chem Biol 24:159-170 (2017)  
Target
Name:
Ezrin
Synonyms:
Cytovillin EZRI_HUMAN Villin-2 | p81
Type:
Protein
Mol. Mass.:
69408.95
Organism:
Homo sapiens (Human)
Description:
P15311
Residue:
586
  
Inhibitor
Name:
BDBM223224
Synonyms:
Disorazole A
Type:
Small organic molecule
Emp. Form.:
C44H60N2O11
Mol. Mass.:
792.954
SMILES:
CO[C@@H]1Cc2nc(co2)C(=O)O[C@@H](CCC[C@H]2O[C@H]2CC[C@@H]2O[C@@H]2c2nc(co2)C(=O)O[C@@H](C\C=C/C(/C)=C\C=C\1)C(C)(C)[C@@H](O)\C=C\C)C(C)(C)[C@@H](O)\C=C\C
: