Target
Ezrin
Ligand
BDBM223225
Substrate
Meas. Tech.
SPR Assay
pH
5.5±n/a
Temperature
298.15±n/a K
Kd
7.492e+4± 7.21e+3 nM
Comments
extracted
Citation
 Rox, KRohde, MChhatwal, GSMüller, R Disorazoles Block Group A Streptococcal Invasion into Epithelial Cells Via Interference with the Host Factor Ezrin. Cell Chem Biol 24:159-170 (2017)  
Target
Name:
Ezrin
Synonyms:
Cytovillin EZRI_HUMAN Villin-2 | p81
Type:
Protein
Mol. Mass.:
69408.95
Organism:
Homo sapiens (Human)
Description:
P15311
Residue:
586
  
Inhibitor
Name:
BDBM223225
Synonyms:
Disorazole Z
Type:
Small organic molecule
Emp. Form.:
C40H46N2O12
Mol. Mass.:
746.7994
SMILES:
COC(=O)C(C)([C@@H](O)\C=C\C)[C@@H]1C\C=C/C=C/C=C/c2nc(co2)C(=O)O[C@@H](C\C=C/C=C/C=C/c2nc(co2)C(=O)O1)C(C)([C@@H](O)\C=C\C)C(=O)OC
: