Target
Interleukin-2
Ligand
BDBM161737
Substrate
Meas. Tech.
IL-2 ELISA Assay
EC50
<100±n/a nM
Citation
 Singh, RDuncton, MZhang, JAlvarez, STso, KHolland, SYen, RKolluri, RHeckrodt, TChen, YMasuda, ELi, HPayan, DGKelley, R Protein kinase C inhibitors and uses thereof US Patent  US9682976 Publication Date 6/20/2017 
Target
Name:
Interleukin-2
Synonyms:
IL-2 IL2_HUMAN Interleukin-2 T-cell growth factor | TCGF
Type:
Enzyme
Mol. Mass.:
17630.05
Organism:
Homo sapiens (Human)
Description:
P60568
Residue:
153
  
Inhibitor
Name:
BDBM161737
Synonyms:
US9682976, 182
Type:
Small organic molecule
Emp. Form.:
C24H29Cl2N9
Mol. Mass.:
514.453
SMILES:
CC1(C)C[C@@H](C[C@@H]2CCCN12)Nc1nc(Nc2ccc(Cl)c(c2)-n2nnnc2C2CC2)ncc1Cl
: