Target
N-acylethanolamine-hydrolyzing acid amidase
Ligand
BDBM223537
Substrate
BDBM223534
Meas. Tech.
NAAA Assay
pH
5±n/a
Temperature
310.15±n/a K
IC50
>100000±n/a nM
Comments
extracted
Citation
 Piomelli, DTarzia, GMor, MDuranti, ATontini, A Compositions and methods of inhibiting N-acylethanolamine-hydrolyzing acid amidase US Patent  US9321743 Publication Date 4/26/2016 
Target
Name:
N-acylethanolamine-hydrolyzing acid amidase
Synonyms:
ASAH-like protein N-acylethanolamine acid amidase (NAAA) N-acylethanolamine-hydrolyzing acid amidase (NAAA) N-acylethanolamine-hydrolyzing acid amidase subunit beta NAAA_RAT | Naaa
Type:
Enzyme
Mol. Mass.:
40306.53
Organism:
Rattus norvegicus (Rat)
Description:
Q5KTC7
Residue:
362
  
Inhibitor
Name:
BDBM223537
Synonyms:
US9321743, Cbz-gly
Type:
Small organic molecule
Emp. Form.:
C10H11NO4
Mol. Mass.:
209.1986
SMILES:
OC(=O)CNC(=O)OCc1ccccc1
:
Substrate
Name:
BDBM223534
Synonyms:
US9321743, Heptadecenoylethanolamide
Type:
Substrate
Emp. Form.:
C19H37NO2
Mol. Mass.:
311.5026
SMILES:
CCCCCC\C=C/CCCCCCCCC(=O)NCCO
: