Target
N-acylethanolamine-hydrolyzing acid amidase
Ligand
BDBM50416515
Substrate
BDBM223534
Meas. Tech.
NAAA Assay
pH
5±n/a
Temperature
310.15±n/a K
IC50
100000±n/a nM
Comments
extracted
Citation
 Piomelli, DTarzia, GMor, MDuranti, ATontini, A Compositions and methods of inhibiting N-acylethanolamine-hydrolyzing acid amidase US Patent  US9321743 Publication Date 4/26/2016 
Target
Name:
N-acylethanolamine-hydrolyzing acid amidase
Synonyms:
ASAH-like protein N-acylethanolamine acid amidase (NAAA) N-acylethanolamine-hydrolyzing acid amidase (NAAA) N-acylethanolamine-hydrolyzing acid amidase subunit beta NAAA_RAT | Naaa
Type:
Enzyme
Mol. Mass.:
40306.53
Organism:
Rattus norvegicus (Rat)
Description:
Q5KTC7
Residue:
362
  
Inhibitor
Name:
BDBM50416515
Synonyms:
CHEMBL1214329 | US9321743, URB820
Type:
Small organic molecule
Emp. Form.:
C13H15NO3
Mol. Mass.:
233.2631
SMILES:
C[C@H]1OC(=O)[C@H]1NC(=O)CCc1ccccc1
:
Substrate
Name:
BDBM223534
Synonyms:
US9321743, Heptadecenoylethanolamide
Type:
Substrate
Emp. Form.:
C19H37NO2
Mol. Mass.:
311.5026
SMILES:
CCCCCC\C=C/CCCCCCCCC(=O)NCCO
: