Target
Vascular endothelial growth factor receptor 2
Ligand
BDBM223585
Substrate
Meas. Tech.
VEGFR2 Kinase Assay
pH
7.4±n/a
Temperature
303.15±n/a K
IC50
286±n/a nM
Comments
extracted
Citation
 Wurster, JYee, RHull, III, CEMalone, TC Kinase inhibitors US Patent  US9321766 Publication Date 4/26/2016 
Target
Name:
Vascular endothelial growth factor receptor 2
Synonyms:
CD_antigen=CD309 Fetal liver kinase 1 (FLK-1) KDR Protein-tyrosine kinase receptor Flk-1 VEGFR-2 VEGFR2 Vascular Endothelial Growth Factor Receptor Kinase 2 Vascular endothelial growth factor receptor 2 (KDR) Vascular endothelial growth factor receptor 2 (VEGFR2) Vascular endothelial growth factor receptor-2 (VEGFR-2)
Type:
Receptor Tyrosine Kinase
Mol. Mass.:
151510.97
Organism:
Homo sapiens (Human)
Description:
P35968
Residue:
1356
  
Inhibitor
Name:
BDBM223585
Synonyms:
US9321766, 2
Type:
Small organic molecule
Emp. Form.:
C22H25N5O
Mol. Mass.:
375.4668
SMILES:
CC(C)(C)c1ccc(cc1)-n1cccc(N2CCc3nc(N)ncc3C2)c1=O
: