Target
Vascular endothelial growth factor receptor 2
Ligand
BDBM223588
Substrate
Meas. Tech.
VEGFR2 Kinase Assay
pH
7.4±n/a
Temperature
303.15±n/a K
IC50
327±n/a nM
Comments
extracted
Citation
 Wurster, JYee, RHull, III, CEMalone, TC Kinase inhibitors US Patent  US9321766 Publication Date 4/26/2016 
Target
Name:
Vascular endothelial growth factor receptor 2
Synonyms:
CD_antigen=CD309 Fetal liver kinase 1 (FLK-1) KDR Protein-tyrosine kinase receptor Flk-1 VEGFR-2 VEGFR2 Vascular Endothelial Growth Factor Receptor Kinase 2 Vascular endothelial growth factor receptor 2 (KDR) Vascular endothelial growth factor receptor 2 (VEGFR2) Vascular endothelial growth factor receptor-2 (VEGFR-2)
Type:
Receptor Tyrosine Kinase
Mol. Mass.:
151510.97
Organism:
Homo sapiens (Human)
Description:
P35968
Residue:
1356
  
Inhibitor
Name:
BDBM223588
Synonyms:
US9321766, 14
Type:
Small organic molecule
Emp. Form.:
C21H24N6O
Mol. Mass.:
376.4549
SMILES:
CN(C)c1cccc(c1)-n1ccc(C)c(N2CCc3nc(N)ncc3C2)c1=O
: