Target
Platelet-derived growth factor receptor beta
Ligand
BDBM223589
Substrate
Meas. Tech.
PDGFRβ Kinase Assay
pH
7.4±n/a
Temperature
303.15±n/a K
IC50
33±n/a nM
Comments
extracted
Citation
 Wurster, JYee, RHull, III, CEMalone, TC Kinase inhibitors US Patent  US9321766 Publication Date 4/26/2016 
Target
Name:
Platelet-derived growth factor receptor beta
Synonyms:
Beta-type platelet-derived growth factor receptor CD140b antigen PDGF Receptor Substrate PDGFR PDGFR-1 PDGFRB PGFRB_HUMAN Platelet-derived growth factor receptor 1 Platelet-derived growth factor receptor beta (PDGFR-beta) Platelet-derived growth factor receptor beta (PDGFRbeta) | VHL/PDGFRB
Type:
Enzyme
Mol. Mass.:
123922.25
Organism:
Homo sapiens (Human)
Description:
P09619
Residue:
1106
  
Inhibitor
Name:
BDBM223589
Synonyms:
US9321766, 17
Type:
Small organic molecule
Emp. Form.:
C25H24N6O3
Mol. Mass.:
456.4965
SMILES:
Cc1ccoc1C(=O)Nc1ccc(cc1)-n1ccc(C)c(N2CCc3nc(N)ncc3C2)c1=O
: