Target
Transient receptor potential cation channel subfamily A member 1
Ligand
BDBM291165
Substrate
Meas. Tech.
Fluorescence Assay
Temperature
298.15±n/a K
IC50
251±n/a nM
Comments
extracted
Citation
 Brotherton-Pleiss, CEChen, HChen, SChen, ZErickson, SDEstrada, AKim, KLi, HLovey, AJLyssikatos, JPQian, YSo, SWovkulich, PMYi, L Substituted sulfonamide compounds US Patent  US9580411 Publication Date 2/28/2017 
Target
Name:
Transient receptor potential cation channel subfamily A member 1
Synonyms:
ANKTM1 TRPA1 Transformation-sensitive protein p120 | Transient receptor potential cation channel subfamily A member 1 (TRPA1)
Type:
Protein
Mol. Mass.:
127514.20
Organism:
Homo sapiens (Human)
Description:
O75762
Residue:
1119
  
Inhibitor
Name:
BDBM291165
Synonyms:
2-(4-Fluoro-N-isopropylphenylsulfonamido)-N-((6-(4-(trifluoromethyl)piperidin-1-yl)pyrimidin-4-yl)methyl)acetamide | US9580411, Example 80
Type:
Small organic molecule
Emp. Form.:
C22H27F4N5O3S
Mol. Mass.:
517.54
SMILES:
CC(C)N(CC(=O)NCc1cc(ncn1)N1CCC(CC1)C(F)(F)F)S(=O)(=O)c1ccc(F)cc1
: