Target
Cathepsin S
Ligand
BDBM225143
Substrate
BDBM225228
Meas. Tech.
Inhibition Assay
IC50
2.6±n/a nM
Citation
 Nakajima, YImada, STakasuna, YAoyama, NNigawara, TShirakami, SShirai, FSato, JNakanishi, KKubo, K Nitrogen-containing bicyclic aromatic heterocyclic compound US Patent  US9328118 Publication Date 5/3/2016 
Target
Name:
Cathepsin S
Synonyms:
CATS_HUMAN Cathepsin S (Cat S) | cathepsin S preproprotein
Type:
Protein
Mol. Mass.:
37507.38
Organism:
Homo sapiens (Human)
Description:
P25774
Residue:
331
  
Inhibitor
Name:
BDBM225143
Synonyms:
US9328118, 45
Type:
Small organic molecule
Emp. Form.:
C22H22F3N7O2
Mol. Mass.:
473.451
SMILES:
CCN1CCN(CC1)C(=O)COc1ccc(cc1C(F)(F)F)-c1nc(nc2n(C)cnc12)C#N
:
Substrate
Name:
BDBM225228
Synonyms:
US9328118, VVR-AMC
Type:
Substrate
Emp. Form.:
C34H45N7O7
Mol. Mass.:
663.7638
SMILES:
CC(C)C(NC(=O)OCc1ccccc1)C(=O)N[C@@H](C(C)C)C(=O)NC(CCCNC(N)=N)C(=O)Nc1ccc2c(C)cc(=O)oc2c1
: