Target
Serine/threonine-protein kinase Chk1 [2-280]
Ligand
BDBM225355
Substrate
Meas. Tech.
33P-Radiometric_Method1
Ki
59.4±n/a nM
Citation
 D3R, DD Abbott CHK1 Kinase D3R 221:0 (2015) Target
Name:
Serine/threonine-protein kinase Chk1 [2-280]
Synonyms:
CHEK1 CHK1_HUMAN | CHK1_Kinase
Type:
Mol. Mass.:
32109.16
Organism:
Homo sapiens (Human)
Description:
O14757[2-280]
Residue:
279
  
Inhibitor
Name:
BDBM225355
Synonyms:
Chk1_78
Type:
Small Organic Molecule
Emp. Form.:
C30H31N3O3
Mol. Mass.:
481.5854
SMILES:
COc1cc(ccc1O)-c1ccc(cc1)-c1[nH]nc-2c1Cc1cc(CNC3CCC(O)CC3)ccc-21
: