Target
Uncharacterized PhzA/B-like protein PA3332
Ligand
BDBM225706
Substrate
Meas. Tech.
Thermofluor_Method2
Kd
3120±253 nM
Citation
 D3R, DD Baker-CSAR DIG-BP D3R 248:0 (2015) Target
Name:
Uncharacterized PhzA/B-like protein PA3332
Synonyms:
DIG-BP Y3332_PSEAE
Type:
Mol. Mass.:
15916.84
Organism:
Pseudomonas aeruginosa (strain ATCC 15692 / DSM 22644 / CIP 104116 / JCM 14847 / LMG 12228 / 1C / PRS 101 / PAO1)
Description:
Residue:
141
  
Inhibitor
Name:
BDBM225706
Synonyms:
CS335
Type:
Small Organic Molecule
Emp. Form.:
C29H42O10
Mol. Mass.:
550.6378
SMILES:
C[C@H]1O[C@@H](O[C@H]2CC[C@]3(C=O)[C@H]4CC[C@]5(C)[C@H](CC[C@]5(O)[C@@H]4CC[C@]3(O)C2)C2=CC(=O)OC2)[C@H](O)[C@@H](O)[C@@H]1O
: