Target
Uncharacterized PhzA/B-like protein PA3332
Ligand
BDBM225707
Substrate
Meas. Tech.
Thermofluor_Method2
Kd
474±67.7 nM
Citation
 D3R, DD Baker-CSAR DIG-BP D3R 248:0 (2015) Target
Name:
Uncharacterized PhzA/B-like protein PA3332
Synonyms:
DIG-BP Y3332_PSEAE
Type:
Mol. Mass.:
15916.84
Organism:
Pseudomonas aeruginosa (strain ATCC 15692 / DSM 22644 / CIP 104116 / JCM 14847 / LMG 12228 / 1C / PRS 101 / PAO1)
Description:
Residue:
141
  
Inhibitor
Name:
BDBM225707
Synonyms:
CS337 | Digoxigenin
Type:
Small Organic Molecule
Emp. Form.:
C23H34O5
Mol. Mass.:
390.5131
SMILES:
C[C@@]12[C@H](CC[C@]1(O)[C@@H]1CC[C@@H]3C[C@@H](O)CC[C@]3(C)[C@H]1C[C@H]2O)C1=CC(=O)OC1
: