Target
Heat shock protein HSP 90-beta
Ligand
BDBM225719
Substrate
Meas. Tech.
ITC
Kd
68.6±8.09 nM
Citation
 D3R, DD AbbVie-CSAR HSP90 D3R 408:0 (2016) Target
Name:
Heat shock protein HSP 90-beta
Synonyms:
HS90B_HUMAN HSP 90 HSP90B HSPCB Heat shock protein HSP 90 (Hsp90)
Type:
Molecular Chaperone
Mol. Mass.:
83229.45
Organism:
Homo sapiens (Human)
Description:
P08238
Residue:
724
  
Inhibitor
Name:
BDBM225719
Synonyms:
hsp90_12
Type:
Small Organic Molecule
Emp. Form.:
C16H16N2O3
Mol. Mass.:
284.3098
SMILES:
CCCc1cc(c(O)cc1O)-n1c2ccccc2[nH]c1=O
: