Target
Bile acid receptor
Ligand
BDBM225992
Substrate
Meas. Tech.
Scintillation Proximity Assay (SPA)
pH
7.4±n/a
IC50
297±n/a nM
Comments
extracted
Citation
 D3R, DD Drug Design Data Resource Grand Challenge 2 Dataset: FXR - Farnesoid X Receptor D3R 882:0 (2017) Target
Name:
Bile acid receptor
Synonyms:
BAR FXR HRR1 NR1H4_HUMAN RIP14 Retinoid X receptor-interacting protein 14 | farnesoid x receptor
Type:
Nuclear Receptor
Mol. Mass.:
55916.24
Organism:
Homo sapiens (Human)
Description:
Q96RI1
Residue:
486
  
Inhibitor
Name:
BDBM225992
Synonyms:
FXR_85
Type:
Small Organic Molecule
Emp. Form.:
C27H25BrN2O5S
Mol. Mass.:
569.467
SMILES:
Cc1ccccc1S(=O)(=O)N1CCC2(CC1)C(=O)N(Cc1ccc(cc1)C(O)=O)c1ccc(Br)cc21
: