Target
Tyrosine-protein kinase BTK
Ligand
BDBM291307
Substrate
Meas. Tech.
BTK Inhibitory Activity
pH
7.5±n/a
IC50
0.888±n/a nM
Comments
extracted
Citation
 Iguchi, SHosoi, FSagara, T Fused pyrimidine compound or salt thereof US Patent  US9580432 Publication Date 2/28/2017 
Target
Name:
Tyrosine-protein kinase BTK
Synonyms:
AGMX1 Agammaglobulinaemia tyrosine kinase B cell progenitor kinase BPK BTK_HUMAN Tyrosine Kinase BTK Tyrosine-protein kinase BTK (BTK)
Type:
Enzyme
Mol. Mass.:
76289.95
Organism:
Homo sapiens (Human)
Description:
Q06187
Residue:
659
  
Inhibitor
Name:
BDBM291307
Synonyms:
US9580432, Example 38
Type:
Small organic molecule
Emp. Form.:
C21H20N8O4
Mol. Mass.:
448.4347
SMILES:
COc1ccc2oc(NC(=O)c3nn([C@@H]4CCN(C4)C(=O)C=C)c4ncnc(N)c34)nc2c1
: