Target
Histamine H1 receptor
Ligand
BDBM181150
Substrate
Meas. Tech.
Binding Assay
IC50
11000±n/a nM
Citation
 Aberg, AKCiofalo, VB Methods of treatment of histamine H-4 receptor-related pruritus associated with nerve disorders US Patent  US9333199 Publication Date 5/10/2016 
Target
Name:
Histamine H1 receptor
Synonyms:
H1R HISTAMINE H1 HRH1_HUMAN
Type:
G Protein-Coupled Receptor (GPCR)
Mol. Mass.:
55808.72
Organism:
Homo sapiens (Human)
Description:
Cell pellets from SK-N-MC cells transfected with human H1 receptor were used in binding assay.
Residue:
487
  
Inhibitor
Name:
BDBM181150
Synonyms:
US9138431, R-NORKETOTIFEN (RNORK) US9138431, RS-NORKETOTIFEN (RSNORK) US9333199, RS-NORKETOTIFEN (NORK)
Type:
Small organic molecule
Emp. Form.:
C18H17NOS
Mol. Mass.:
295.399
SMILES:
O=[#6]-1-[#6]-c2ccccc2\[#6](-c2ccsc-12)=[#6]-1/[#6]-[#6]-[#7]-[#6]-[#6]-1
: