Target
Histamine H1 receptor
Ligand
BDBM227454
Substrate
Meas. Tech.
Binding Assay
IC50
17000±n/a nM
Citation
 Aberg, AKCiofalo, VB Methods of treatment of histamine H-4 receptor-related pruritus associated with nerve disorders US Patent  US9333199 Publication Date 5/10/2016 
Target
Name:
Histamine H1 receptor
Synonyms:
H1R HISTAMINE H1 HRH1_HUMAN
Type:
G Protein-Coupled Receptor (GPCR)
Mol. Mass.:
55808.72
Organism:
Homo sapiens (Human)
Description:
Cell pellets from SK-N-MC cells transfected with human H1 receptor were used in binding assay.
Residue:
487
  
Inhibitor
Name:
BDBM227454
Synonyms:
US9333199, R-NORKETOTIFEN (RNORK)
Type:
Small organic molecule
Emp. Form.:
C19H21NOS
Mol. Mass.:
311.441
SMILES:
[#6]-[#8]-[#6@H]-1-[#6]-c2ccccc2\[#6](-c2ccsc-12)=[#6]-1/[#6]-[#6]-[#7]-[#6]-[#6]-1
: