Target
Histamine H1 receptor
Ligand
BDBM94597
Substrate
Meas. Tech.
Binding Assay
IC50
2300±n/a nM
Citation
 Aberg, AKCiofalo, VB Methods of treatment of histamine H-4 receptor-related pruritus associated with nerve disorders US Patent  US9333199 Publication Date 5/10/2016 
Target
Name:
Histamine H1 receptor
Synonyms:
H1R HISTAMINE H1 HRH1_HUMAN
Type:
G Protein-Coupled Receptor (GPCR)
Mol. Mass.:
55808.72
Organism:
Homo sapiens (Human)
Description:
Cell pellets from SK-N-MC cells transfected with human H1 receptor were used in binding assay.
Residue:
487
  
Inhibitor
Name:
BDBM94597
Synonyms:
(Z)-2-butenedioate;10-(1-methyl-4-piperidinylidene)-5H-benzo[1,2]cyclohepta[3,4-b]thiophen-4-one 10-(1-methyl-4-piperidylidene)-5H-benzo[1,2]cyclohepta[3,4-b]thiophen-4-one;maleate Ketotifen fumarate SMR001307257 US9333199, KETOTIFEN cid_5282408
Type:
Small organic molecule
Emp. Form.:
C19H19NOS
Mol. Mass.:
309.425
SMILES:
[#6]-[#7]-1-[#6]-[#6]\[#6](-[#6]-[#6]-1)=[#6]-1/c2ccsc2-[#6](=O)-[#6]-c2ccccc-12
: