Target
Histamine H4 receptor
Ligand
BDBM227453
Substrate
Meas. Tech.
Binding Assay
Ki
1100±n/a nM
Citation
 Aberg, AKCiofalo, VB Methods of treatment of histamine H-4 receptor-related pruritus associated with nerve disorders US Patent  US9333199 Publication Date 5/10/2016 
Target
Name:
Histamine H4 receptor
Synonyms:
AXOR35 GPCR105 HH4R HRH4 Histamine H4 receptor Histamine receptor (H3 and H4) SP9144
Type:
G Protein-Coupled Receptor (GPCR)
Mol. Mass.:
44517.02
Organism:
Homo sapiens (Human)
Description:
Binding assays were using CHO cells stably expressing hH4R receptors.
Residue:
390
  
Inhibitor
Name:
BDBM227453
Synonyms:
US9333199, S-NORKETOTIFEN (SNORK)
Type:
Small organic molecule
Emp. Form.:
C19H21NOS
Mol. Mass.:
311.441
SMILES:
[#6]-[#8]-[#6@@H]-1-[#6]-c2ccccc2\[#6](-c2ccsc-12)=[#6]-1/[#6]-[#6]-[#7]-[#6]-[#6]-1
: