Target
Histamine H4 receptor
Ligand
BDBM50073179
Substrate
Meas. Tech.
Binding Assay
Ki
16000±n/a nM
Citation
 Aberg, AKCiofalo, VB Methods of treatment of histamine H-4 receptor-related pruritus associated with nerve disorders US Patent  US9333199 Publication Date 5/10/2016 
Target
Name:
Histamine H4 receptor
Synonyms:
AXOR35 GPCR105 HH4R HRH4 Histamine H4 receptor Histamine receptor (H3 and H4) SP9144
Type:
G Protein-Coupled Receptor (GPCR)
Mol. Mass.:
44517.02
Organism:
Homo sapiens (Human)
Description:
Binding assays were using CHO cells stably expressing hH4R receptors.
Residue:
390
  
Inhibitor
Name:
BDBM50073179
Synonyms:
8-Chloro-11-piperidin-4-ylidene-6,11-dihydro-5H-benzo[5,6]cyclohepta[1,2-b]pyridine Clarinex Claritin-D SCH-34117 US9333199, DESLORATADINE (Clarinex)
Type:
Small organic molecule
Emp. Form.:
C19H19ClN2
Mol. Mass.:
310.821
SMILES:
Clc1ccc2c(-[#6]-[#6]-c3cccnc3\[#6]-2=[#6]-2/[#6]-[#6]-[#7]-[#6]-[#6]-2)c1
: