Target
Beta-glucuronidase
Ligand
BDBM163637
Substrate
Meas. Tech.
Activity Assay
EC50
28.3±2.11 nM
Citation
 Redinbo, MR Selective β-glucuronidase inhibitors as a treatment for side effects of camptothecin antineoplastic agents US Patent  US9334288 Publication Date 5/10/2016 
Target
Name:
Beta-glucuronidase
Synonyms:
β-Glucuronidase Beta-G1 GUSB | beta-Glucuronidase (β-glucuronidase)
Type:
Protein
Mol. Mass.:
74736.05
Organism:
Homo sapiens (Human)
Description:
Residue:
651
  
Inhibitor
Name:
BDBM163637
Synonyms:
3[(6,7Dimethyl2oxo1,2dihydroquinolin3yl)methyl]3(2hydroxyethyl)1(3 methoxyphenyl)thiourea (Inh 2) | US9334288, 4
Type:
Small organic molecule
Emp. Form.:
C22H25N3O3S
Mol. Mass.:
411.517
SMILES:
COc1cccc(NC(=S)N(CCO)Cc2cc3cc(C)c(C)cc3[nH]c2=O)c1
: