Target
Beta-glucuronidase
Ligand
BDBM163641
Substrate
Meas. Tech.
Cell-Based Assay
IC50
1266.4±86.12 nM
Citation
 Redinbo, MR Selective β-glucuronidase inhibitors as a treatment for side effects of camptothecin antineoplastic agents US Patent  US9334288 Publication Date 5/10/2016 
Target
Name:
Beta-glucuronidase
Synonyms:
β-Glucuronidase Beta-G1 GUSB | beta-Glucuronidase (β-glucuronidase)
Type:
Protein
Mol. Mass.:
74736.05
Organism:
Homo sapiens (Human)
Description:
Residue:
651
  
Inhibitor
Name:
BDBM163641
Synonyms:
1[2(3Fluorophenyl)5H,6H,7H,8Hpyrazolo[3,2b]quinazolin9yl]piperazine (Inh 6) | US9334288, 7
Type:
Small organic molecule
Emp. Form.:
C20H22FN5
Mol. Mass.:
351.4206
SMILES:
Fc1cccc(c1)-c1cc2nc3CCCCc3c(N3CCNCC3)n2n1
: