Target
Serine/threonine-protein kinase receptor R3
Ligand
BDBM143207
Substrate
Meas. Tech.
ALK1-6 enzymatic assays
pH
7.5±n/a
IC50
25±n/a nM
Comments
extracted
Citation
 Alimardanov, ACuny, GDGrewal, GSLee, AMcKew, JCMohedas, AHShen, MXu, XYu, PB BMP inhibitors and methods of use thereof US Patent  US9682983 Publication Date 6/20/2017 
Target
Name:
Serine/threonine-protein kinase receptor R3
Synonyms:
ACVL1_HUMAN ACVRLK1 Activin receptor-like kinase 1 (ALK-1) | Serine/threonine-protein kinase receptor R3 (ALK1)
Type:
Enzyme
Mol. Mass.:
56134.46
Organism:
Homo sapiens (Human)
Description:
P37023
Residue:
503
  
Inhibitor
Name:
BDBM143207
Synonyms:
US10017516, Compound 7 | US9682983, 7
Type:
Small organic molecule
Emp. Form.:
C22H19N7S
Mol. Mass.:
413.498
SMILES:
C1CN(CCN1)c1cnc(s1)-c1cnc2c(cnn2c1)-c1ccnc2ccccc12
: