Target
Activin receptor type-1
Ligand
BDBM143207
Substrate
Meas. Tech.
ALK1-6 enzymatic assays
pH
7.5±n/a
IC50
19±n/a nM
Comments
extracted
Citation
 Alimardanov, ACuny, GDGrewal, GSLee, AMcKew, JCMohedas, AHShen, MXu, XYu, PB BMP inhibitors and methods of use thereof US Patent  US9682983 Publication Date 6/20/2017 
Target
Name:
Activin receptor type-1
Synonyms:
2.7.11.30 ACVR1 ACVRLK2 ALK2/ACVR1 Activin receptor-like kinase 2 Activin receptor-like kinase 2 (ALK2/ACVR1) SKR1 TGF-B superfamily receptor type I | TSR-I
Type:
Mol. Mass.:
57158.32
Organism:
Homo sapiens (Human)
Description:
Residue:
509
  
Inhibitor
Name:
BDBM143207
Synonyms:
US10017516, Compound 7 | US9682983, 7
Type:
Small organic molecule
Emp. Form.:
C22H19N7S
Mol. Mass.:
413.498
SMILES:
C1CN(CCN1)c1cnc(s1)-c1cnc2c(cnn2c1)-c1ccnc2ccccc12
: