Target
Membrane primary amine oxidase
Ligand
BDBM291386
Substrate
Meas. Tech.
Biological Assay
IC50
>1000±n/a nM
Citation
 Patient, LEvans, DSimpson, IPowell, A Compounds US Patent  US9580415 Publication Date 2/28/2017 
Target
Name:
Membrane primary amine oxidase
Synonyms:
AOC3 Amine oxidase, copper containing Semicarbazide-sensitive amine oxidase/ Vascular adhesion protein 1 (SSAO/VAP-1) Vascular adhesion protein 1 (VAP-1)
Type:
Protein
Mol. Mass.:
84620.86
Organism:
Homo sapiens (Human)
Description:
Q16853
Residue:
763
  
Inhibitor
Name:
BDBM291386
Synonyms:
US9580415, Example 20 | {[1-(4-Chlorophenyl)-2-(pyridin-3-yl)-1H-pyrrolo[2,3-c]pyridin-3-yl]methyl}dimethyl amine
Type:
Small organic molecule
Emp. Form.:
C21H19ClN4
Mol. Mass.:
362.855
SMILES:
CN(C)Cc1c(-c2cccnc2)n(-c2ccc(Cl)cc2)c2cnccc12
: