Target
E3 ubiquitin-protein ligase XIAP [125-356,C202A,C213G]
Ligand
BDBM228607
Substrate
Meas. Tech.
Homogeneous Time Resolved Fluorescence (HTRF) Assay
Temperature
298.15±n/a K
IC50
4±n/a nM
Comments
extracted
Citation
 Kim, KS IAP antagonists US Patent  US9345740 Publication Date 5/24/2016 
Target
Name:
E3 ubiquitin-protein ligase XIAP [125-356,C202A,C213G]
Synonyms:
Aipa Birc4 Miha Xiap
Type:
Protein
Mol. Mass.:
26277.76
Organism:
Mus musculus (Mouse)
Description:
BIR2-3 (125-356, C202A/C213G, XIAP)
Residue:
232
  
Inhibitor
Name:
BDBM228607
Synonyms:
US9345740, 4
Type:
Small organic molecule
Emp. Form.:
C62H82N10O8Si
Mol. Mass.:
1123.4622
SMILES:
CN[C@@H](C)C(=O)NC(Cc1ccc(cc1)C(=O)Nc1ccc(cc1)C(=O)N[C@H]1C[C@H](N(C1)C(=O)[C@@H](NC(=O)[C@H](C)NC)C(C)(C)C)C(=O)NC1CCCc2ccccc12)C(=O)N1C[Si](C)(C)C[C@H]1C(=O)NC1CCCc2ccccc12
: