Target
Tyrosine-protein kinase BTK
Ligand
BDBM291519
Substrate
Meas. Tech.
Enzyme Assay
pH
7.5±n/a
Temperature
300.15±n/a K
IC50
<100±n/a nM
Comments
extracted
Citation
 Hodous, BLLiu-Bujalski, LJones, RBankston, DJohnson, TLMochalkin, INguyen, NQiu, HGoutopoulos, ABrugger, N Compositions and methods for the production of pyrimidine and pyridine compounds with BTK inhibitory activity US Patent  US9580449 Publication Date 2/28/2017 
Target
Name:
Tyrosine-protein kinase BTK
Synonyms:
AGMX1 Agammaglobulinaemia tyrosine kinase B cell progenitor kinase BPK BTK_HUMAN Tyrosine Kinase BTK Tyrosine-protein kinase BTK (BTK)
Type:
Enzyme
Mol. Mass.:
76289.95
Organism:
Homo sapiens (Human)
Description:
Q06187
Residue:
659
  
Inhibitor
Name:
BDBM291519
Synonyms:
(E)-N-(3-(4-amino-6-(4-phenoxyphenoxy)pyrimidin-5-yl)phenyl)-4-(dimethylamino)but-2-enamide US9580449, Example A248
Type:
Small organic molecule
Emp. Form.:
C28H27N5O3
Mol. Mass.:
481.5457
SMILES:
CN(C)C\C=C\C(=O)Nc1cccc(c1)-c1c(N)ncnc1Oc1ccc(Oc2ccccc2)cc1
: