Target
Dual specificity protein kinase TTK
Ligand
BDBM230951
Substrate
Meas. Tech.
Kinase Assay
pH
7±n/a
Temperature
298.15±n/a K
IC50
23±n/a nM
Comments
extracted
Citation
 Hoelder, SBlagg, JCheung, KJAtrash, BSheldrake, P Pharmacologically active compounds US Patent  US9334286 Publication Date 5/10/2016 
Target
Name:
Dual specificity protein kinase TTK
Synonyms:
Dual specificity protein kinase (TTK) MPS1 Monopolar Spindle 1 (MPS1) Monopolar Spindle 1 Kinase (MPS1) TTK | TTK_HUMAN
Type:
Protein
Mol. Mass.:
97086.79
Organism:
Homo sapiens (Human)
Description:
P33981
Residue:
857
  
Inhibitor
Name:
BDBM230951
Synonyms:
US10188642, Example 77 | US9334286, 77
Type:
Small organic molecule
Emp. Form.:
C25H23ClN6O2
Mol. Mass.:
474.942
SMILES:
Cc1nnc(o1)-c1ccc(Nc2cc3cc(ccc3cn2)-c2cnn(CC(C)(C)O)c2)c(Cl)c1
: