Target
Transient receptor potential cation channel subfamily V member 4
Ligand
BDBM230232
Substrate
Meas. Tech.
Inhibition Assay
Temperature
310.15±n/a K
Ki
4700±n/a nM
IC50
9700±n/a nM
Comments
extracted
Citation
 Yukimasa, A Aromatic heterocyclic derivative having TRPV4-inhibiting activity US Patent  US9340500 Publication Date 5/17/2016 
Target
Name:
Transient receptor potential cation channel subfamily V member 4
Synonyms:
TRPV4 Transient receptor potential cation channel subfamily V member 4 (TRPV4) VROAC
Type:
Enzyme
Mol. Mass.:
98290.10
Organism:
Homo sapiens (Human)
Description:
Q9HBA0
Residue:
871
  
Inhibitor
Name:
BDBM230232
Synonyms:
US9340500, I-076
Type:
Small organic molecule
Emp. Form.:
C25H33F3N4O2
Mol. Mass.:
478.5503
SMILES:
Cc1c(cc(C2CCNCC2)n1CCCN1CCOCC1)C(=O)Nc1cccc(c1)C(F)(F)F
: