Target
Transient receptor potential cation channel subfamily V member 4
Ligand
BDBM230233
Substrate
Meas. Tech.
Inhibition Assay
Temperature
310.15±n/a K
Ki
2000±n/a nM
IC50
4700±n/a nM
Comments
extracted
Citation
 Yukimasa, A Aromatic heterocyclic derivative having TRPV4-inhibiting activity US Patent  US9340500 Publication Date 5/17/2016 
Target
Name:
Transient receptor potential cation channel subfamily V member 4
Synonyms:
TRPV4 Transient receptor potential cation channel subfamily V member 4 (TRPV4) VROAC
Type:
Enzyme
Mol. Mass.:
98290.10
Organism:
Homo sapiens (Human)
Description:
Q9HBA0
Residue:
871
  
Inhibitor
Name:
BDBM230233
Synonyms:
US9340500, I-077
Type:
Small organic molecule
Emp. Form.:
C27H35F3N4O3
Mol. Mass.:
520.587
SMILES:
CC(=O)N1CCC(CC1)c1cc(C(=O)Nc2cccc(c2)C(F)(F)F)c(C)n1CCCN1CCOCC1
: