Target
Neutrophil elastase
Ligand
BDBM230325
Substrate
Meas. Tech.
Human Neutrophil Elastase Assay
pH
7.5±n/a
Temperature
298.15±n/a K
IC50
30±n/a nM
Comments
extracted
Citation
 Oost, TFiegen, DGnamm, CHandschuh, SPeters, SRoth, GJ Substituted 4-pyridones and their use as inhibitors of neutrophil elastase activity US Patent  US9340507 Publication Date 5/17/2016 
Target
Name:
Neutrophil elastase
Synonyms:
Bone marrow serine protease Coagulation factor X ELANE Elastase HLE Leukocyte elastase Medullasin Neutrophil elastase (HNE) PMN elastase Trypsin
Type:
Enzyme
Mol. Mass.:
28532.38
Organism:
Homo sapiens (Human)
Description:
P08246
Residue:
267
  
Inhibitor
Name:
BDBM230325
Synonyms:
US9340507, 6
Type:
Small organic molecule
Emp. Form.:
C25H23F3N2O4S
Mol. Mass.:
504.521
SMILES:
Cc1c(-c2cccc(c2)C(F)(F)F)c(=O)c(cn1C1CC1)C(=O)NCc1ccc(cc1)S(C)(=O)=O
: