Target
Melanocortin receptor 5
Ligand
BDBM232172
Substrate
Meas. Tech.
Radioligand Binding Assay
pH
7.4±n/a
Temperature
310.15±n/a K
IC50
<100±n/a nM
Comments
extracted
Citation
 Blaskovich, MACassidy, PJ Methods of modulating the activity of the MC5 receptor and treatment of conditions related to this receptor US Patent  US9340517 Publication Date 5/17/2016 
Target
Name:
Melanocortin receptor 5
Synonyms:
MC-2 MC5R Melanocortin MC5 Melanocortin receptor 5 | Melanocortin receptor 5 (MC5R)
Type:
Enzyme
Mol. Mass.:
36612.92
Organism:
Homo sapiens (Human)
Description:
P33032
Residue:
325
  
Inhibitor
Name:
BDBM232172
Synonyms:
US9340517, 560
Type:
Small Organic Molecule
Emp. Form.:
C27H42Cl2N4O2
Mol. Mass.:
525.554
SMILES:
CCC(C)(CC)CN1CC[C@H](CNC(=O)c2ccc(Cl)c(Cl)c2)N[C@H](CCN2CCCCC2)C1=O
: