Target
Guanine nucleotide-binding protein subunit alpha-15 [Y147C]/N-formyl peptide receptor 2
Ligand
BDBM230854
Substrate
Meas. Tech.
Intracellular Calcium Assay
EC50
21.7±n/a nM
Citation
 Bur, DCorminboeuf, OCren, SGrisostomi, CLeroy, XRichard-Bildstein, S Hydroxylated aminotriazole derivatives as ALX receptor agonists US Patent  US9346793 Publication Date 5/24/2016 
Target
Name:
Guanine nucleotide-binding protein subunit alpha-15 [Y147C]/N-formyl peptide receptor 2
Synonyms:
ALX receptor and the G-protein Gα16
Type:
Protein
Mol. Mass.:
Description:
Components:
This complex has 2 components.
Component 1
Name:
N-formyl peptide receptor 2
Synonyms:
ALXR, FPRL1, FPR2 FPR2 FPRH1 Formyl Peptide Receptor-Like 1 LXA4 receptor Lipoxin A4 receptor RFP | hFPRL
Type:
G Protein-Coupled Receptor (GPCR)
Mol. Mass.:
38968.35
Organism:
Homo sapiens (Human)
Description:
P25090
Residue:
351
  
Component 2
Name:
Guanine nucleotide-binding protein subunit alpha-15
Synonyms:
G protein alpha 16 G-protein subunit alpha-16 (G alpha-16) GNA15_HUMAN Guanine nucleotide-binding protein subunit alpha-15 [Y147C]
Type:
Protein
Mol. Mass.:
43577.62
Organism:
Homo sapiens (Human)
Description:
P30679
Residue:
374
  
Inhibitor
Name:
BDBM230854
Synonyms:
US9346793, 5
Type:
Small organic molecule
Emp. Form.:
C21H19F3N6O4
Mol. Mass.:
476.4086
SMILES:
Cc1nc(C(=O)Nc2cnn(Cc3nc(co3)C(C)(C)O)n2)c(o1)-c1cccc(c1)C(F)(F)F
: