Target
Aurora kinase A
Ligand
BDBM155570
Substrate
Meas. Tech.
Kinase Assay
pH
7.4±n/a
Temperature
298.15±n/a K
IC50
0.9±n/a nM
Comments
extracted
Citation
 Sugimoto, TTakahashi, HMitsuya, MMasuko, NSootome, H Piperidine compound or salt thereof US Patent  US9346787 Publication Date 5/24/2016 
Target
Name:
Aurora kinase A
Synonyms:
AIK ARK-1 AURA AURKA_HUMAN Aurora 2 Aurora kinase A (AURKA) Aurora kinase A (Aurora-2) Aurora/IPL1-related kinase 1 Breast tumor-amplified kinase IAK1 STK15 GN Serine/threonine kinase 15 Serine/threonine-protein kinase 6 Serine/threonine-protein kinase aurora-A aurora-2 | hARK1
Type:
Serine/threonine-protein kinase
Mol. Mass.:
45830.98
Organism:
Homo sapiens (Human)
Description:
O14965
Residue:
403
  
Inhibitor
Name:
BDBM155570
Synonyms:
US10092556, Example 14 US9346787, 14
Type:
Small organic molecule
Emp. Form.:
C24H25ClF2N6O2
Mol. Mass.:
502.944
SMILES:
CNC(=O)C1(Cc2ccc(F)c(Nc3cc(C)[nH]n3)n2)CCN(CC1)C(=O)c1cccc(Cl)c1F
: